{"text_format":"1","workbook":"xlsx","n_sheets":6,"sheets":["Note","1) Dati PDP dichiarati ","2) Dati Bollette dichiarati","3) Parametri","4) Risultati di calcolo","Service"],"not_rendered":{"charts":0,"images":1,"macros":1,"external_links":0,"defined_names":5,"comments":0,"pivot_tables":0},"unopened":[],"bounds":{"document_bytes":16777216,"sheet_cells":100000,"rows_first":2000,"rows_last":500,"rows_between":2000,"halvings":0,"cell_chars":16384,"cell_head_chars":4096},"cells_cut":0,"cells_raw":0,"read":"whole","date_system":"1900"}

{"sheet":"Note","index":0,"n_rows":10,"n_cols":3,"rows_kept":10,"cut":false,"hidden":false,"merged":[]}
[]
[null,null,"Meccanismo di cui all'art. 16.quinques del TIV, come integrato con delibera AEEGSI 279/2017/R/COM"]
[null,"a","Il presente file è stato predisposto dalla CSEA ai fini del calcolo, per l'anno 2016,  dell'entità del contributo previsto dall'art. 16.quinques del TIV - \"Meccanismo incentivante per una maggiore diffusione della bolletta elettronica, atto alla reintegrazione del differenziale tra lo sconto applicato ai sensi dell’articolo  13,  comma  6  dell’Allegato  A  alla  deliberazione 501/2014/R/COM e la stima del costo evitato conseguito"]
[null,"b","Ai sensi di quanto previsto dall'art. 16.quinques.2 del TIV, possono partecipare al meccanismo di cui al presente articolo i soli esercenti la maggior tutela  che nel  corso  di  ciascun  anno di ciascun anno oggetto  di reintegrazione hanno emesso bollette con applicazione  dello  sconto  di  cui  all’articolo  13,  comma  6 dell’Allegato   A   alla   deliberazione   501/2014/R/com,   nei   \nconfronti  di  una  percentuale  minima \"a\", indicata alla Tabelle 13 del TIV, di  clienti di  cui  al comma   2.3,   lettere   a)   e   c) del TIV (per gli anni 2016 e 2017 a = 7%)"]
[null,"c","Il file si compone di 4 distinti fogli di lavoro, oltre al presente foglio \"note\" ed ul unteriore foglio \"Service\" utilizzato per l'automazione di alcune funzioni. L'esercente che intende partecipare al meccanismo di compensazione, è tenuto a compilare, nelle celle editabili, i fogli di lavoro denominati \"1) Dati PDP dichiarati\"; \"2) Dati Bollette dichiarati."]
[null,"d","Nel foglio \"3) Parametri\", sono riepilogati i parametri di calcolo utilizzati, secondo quanto disposto dal TIV."]
[null,"e","Nel foglio \"4) Risultati di calcolo\", sono riepilogati i risultati dei calcoli sviluppati."]
[]
[]
[null,"Rev. 1"]

{"sheet":"1) Dati PDP dichiarati ","index":1,"n_rows":36,"n_cols":8,"rows_kept":36,"cut":false,"hidden":false,"merged":[[31,2,33,2],[27,2,29,2],[11,2,13,2],[19,2,21,2],[23,2,25,2],[19,3,21,4],[17,3,17,4],[6,2,8,2],[6,3,8,3],[6,4,7,4],[31,3,33,4],[32,5,32,6],[27,3,29,4],[28,5,28,6],[23,3,25,4],[27,7,29,7],[15,5,15,6],[2,5,2,7],[3,5,3,7],[24,5,24,6],[20,5,20,6],[12,5,12,6],[11,7,13,7],[5,5,5,6],[10,5,10,6],[2,2,2,4],[3,2,3,4],[6,7,8,7],[16,3,16,4],[16,6,17,6],[7,5,7,6],[11,3,13,3],[11,4,12,4]]}
[]
[]
[null,null,"Ragione sociale esercente il servizio di Maggior Tutela                                                                                                                                      (effettuare scelta tramite il menù a tendina)"]
[null,null,"P.IVA",null,null,{"$f":"VLOOKUP(F3,Service!F5:N150,2,FALSE)","v":{"$error":"#N/A"}}]
[]
[null,null,null,null,null,"Dichiarazione di raggiungimento livello di soglia nell'anno Y"]
[null,null,1,"E' stato raggiunto nell'anno Y il livello di soglia di cui alla Tab. 13 del TIV necessario ai fini della partecipazione al meccanismo incentivante per una maggiore diffusione della bolletta elettronica ?","Valore di soglia \"a\" di cui alla Tab. 13 del TIV","Punti di prelievo di clienti domestici in BT","Altri punti di prelievo in BT","Il contenuto delle celle deve essere inserito utilizzando il menù a tendina"]
[null,null,null,null,null," (anno di riferimento del dato: 2016)"]
[null,null,null,null,"a ≥ 7%","SI","SI"]
[]
[null,null,null,null,null,"Dichiarazione di raggiungimento livello di soglia nell'anno Y - 1"]
[null,null,2,"E' stato raggiunto nell'anno Y-1 il livello di soglia di cui alla Tab. 13 del TIV necessario ai fini della partecipazione al meccanismo incentivante per una maggiore diffusione della bolletta elettronica ?","Valore di soglia \"a\" di cui alla Tab. 13 del TIV","Punti di prelievo di clienti domestici in BT","Altri punti di prelievo in BT","Il contenuto delle celle deve essere inserito utilizzando il menù a tendina"]
[null,null,null,null,null,"Anno di riferimento del dato: Y - 1. Attenzione: per l'anno 2106 le celle non debbono essere valorizzate"]
[null,null,null,null,"a ≥ 7%","NO","NO"]
[]
[null,null,null,null,null,"Dichiarazione della tipologia di esercente la maggior tutela"]
[null,null,3,"Esercente la maggior tutela che alla data del 31/12/2015 serviva un numero di pdp superiore a 10 ML",null,"SI","Effettuare la scelta nella cella compilabile (sfondo bianco), tramite il menù a tendina"]
[null,null,4,"Esercente la maggior tutela che alla data del 31/12/2015 serviva un numero di pdp inferiore a 10 ML di clienti",null,{"$f":"IF($F$17=\"SI\",\"NO\",\"SI\")","v":"NO"}]
[]
[null,null,5,"PDPc,Y - per ciascuna delle tipologie di clienti c di cui al comma 2.3, lettere a) e c), il numero di punti di prelievo serviti nell’anno Y nei confronti dei quali è stata emessa almeno una bolletta con applicazione dello sconto di cui all’articolo 13, comma 6 dell’Allegato A alla deliberazione 501/2014/R/com; i clienti multisito, cui viene emessa un'unica bolletta contabilizzante i consumi relativi a tutti i punti di prelievo serviti, vengono contabilizzati come unico punto di prelievo",null,"Punti di prelievo di clienti domestici in BT","Altri punti di prelievo in BT"]
[null,null,null,null,null," (anno di riferimento del dato: 2016)"]
[]
[]
[null,null,6,"PDPc,YTOT - è per ciascuna delle tipologie di clienti c di cui al comma 2.3, lettere a) e c), il numero di punti di prelievo serviti nell’anno Y",null,"Punti di prelievo di clienti domestici in BT  ","Altri punti di prelievo in BT"]
[null,null,null,null,null," (anno di riferimento del dato: 2016)"]
[]
[]
[null,null,7,"PDPc,anteY - è nei casi in cui l’esercente la maggior tutela nell’anno Y-1 non abbia raggiunto il livello a di cui alla Tabella 13, per ciascuna delle tipologie di clienti c di cui al comma 2.3, lettere a) e c), il numero di punti di prelievo serviti nell’anno Y-1 – nei confronti dei quali è stata emessa almeno una bolletta con applicazione dello sconto di cui all’articolo 13, comma 6 dell’Allegato A alla deliberazione 501/2014/R/com; i clienti multisito, cui viene emessa un'unica bolletta contabilizzante i consumi relativi a tutti i punti di prelievo serviti, vengono contabilizzati come unico punto di prelievo. Nei casi diversi dal precedente alinea, il valore è pari a zero.",null,"Punti di prelievo di clienti domestici in BT","Altri punti di prelievo in BT","Le celle possono essere compilate solo se nell'anno Y - 1, nel rigo 2,  è stato scelto \"NO\"."]
[null,null,null,null,null,"Anno di riferimento del dato: Y - 1. Attenzione: per l'anno 2106 le celle non debbono essere valorizzate"]
[null,null,null,null,null,0,0]
[]
[null,null,8,"PDPc,Y-2 - per ciascuna delle tipologie di clienti c di cui al comma 2.3, lettere a) e c), con riferimento alle determinazioni relative agli anni 2016 e 2017, il numero di punti di prelievo serviti nell’anno Y-2 nei confronti dei quali è stata emessa almeno una bolletta in formato elettronico; i clienti multisito, cui viene emessa un'unica bolletta contabilizzante i consumi relativi a tutti i punti di prelievo serviti, vengono contabilizzati come unico punto di prelievo",null,"Punti di prelievo di clienti domestici in BT","Altri punti di prelievo in BT"]
[null,null,null,null,null," (anno di riferimento del dato: 2014)"]
[]
[]
[null,"Rev. 1"]

{"sheet":"2) Dati Bollette dichiarati","index":2,"n_rows":31,"n_cols":7,"rows_kept":31,"cut":false,"hidden":false,"merged":[[2,3,2,4],[2,5,2,6],[3,3,3,4],[3,5,3,6],[6,3,8,4],[7,5,7,6],[22,3,24,4],[23,5,23,6],[26,3,28,4],[27,5,27,6],[10,3,12,4],[11,5,11,6],[14,3,16,4],[15,5,15,6],[18,3,20,4],[19,5,19,6],[6,2,8,2],[26,2,28,2],[22,2,24,2],[18,2,20,2],[14,2,16,2],[10,2,12,2]]}
[]
[]
[null,null,null,"Ragione sociale esercente il servizio di Maggior Tutela",null,{"$f":"'1) Dati PDP dichiarati '!F3:G3","v":0}]
[null,null,null,"P.IVA",null,{"$f":"'1) Dati PDP dichiarati '!F4:G4","v":{"$error":"#N/A"}}]
[null,null,null,null,null,{"$f":"'1) Dati PDP dichiarati '!F14","v":"NO"},{"$f":"'1) Dati PDP dichiarati '!G14","v":"NO"}]
[]
[null,null,9,"Bollc,YEM_SC - per ciascuna delle tipologie di clienti c di cui al comma 2.3, lettere a) e c), il numero di bollette contenenti lo sconto di cui all’articolo 13, comma 6 dell’Allegato A alla deliberazione 501/2014/R/com emesse nell’anno Y",null,"Punti di prelievo di clienti domestici in BT","Altri punti di prelievo in BT"]
[null,null,null,null,null," (anno di riferimento del dato: 2016)"]
[]
[]
[null,null,10,"Bollc,anteYEM_SC - nei casi in cui l’esercente la maggior tutela nell’anno Y-1 non abbia raggiunto il livello a di cui alla Tabella 13, per ciascuna delle tipologie di clienti c di cui al comma 2.3, lettere a) e c), il numero di bollette contenenti lo sconto di cui all’articolo 13, comma 6 dell’Allegato A alla deliberazione 501/2014/R/com emesse nell’anno Y-1",null,"Punti di prelievo di clienti domestici in BT  ","Altri punti di prelievo in BT"]
[null,null,null,null,null," (anno di riferimento del dato: Y - 1. Attenzione: per l'anno 2016 le celle non devono essere valorizzate)"]
[]
[]
[null,null,11,"Bollc,Y-2EM_FE - per ciascuna delle tipologie di clienti c di cui al comma 2.3, lettere a) e c), con riferimento alle determinazioni relative agli anni 2016 e 2017, il numero di bollette in formato elettronico emesse nell’anno Y-2",null,"Punti di prelievo di clienti domestici in BT","Altri punti di prelievo in BT"]
[null,null,null,null,null," (anno di riferimento del dato: 2014)"]
[]
[]
[null,null,12,"Bollc,YPeriod - per ciascuna delle tipologie di clienti c di cui al comma 2.3, lettere a) e c), il numero di bollette annue da emettere ai sensi della regolazione vigente nell’anno Y",null,"Punti di prelievo di clienti domestici in BT","Altri punti di prelievo in BT"]
[null,null,null,null,null," (anno di riferimento del dato: 2016)"]
[]
[]
[null,null,13,"Bollc,anteYPeriod - nei casi in cui l’esercente la maggior tutela nell’anno Y-1 non abbia raggiunto il livello a di cui alla Tabella 13, per ciascuna delle tipologie di clienti c di cui al comma 2.3, lettere a) e c), il numero di bollette annue da emettere ai sensi della regolazione vigente nell’anno Y-1",null,"Punti di prelievo di clienti domestici in BT","Altri punti di prelievo in BT"]
[null,null,null,null,null," (anno di riferimento del dato: Y - 1. Attenzione: per l'anno 2016 le celle non devono essere valorizzate)"]
[]
[]
[null,null,14,"Bollc,Y-2Period -per ciascuna delle tipologie di clienti c di cui al comma 2.3, lettere a) e c), con riferimento alle determinazioni relative agli anni 2016 e 2017, il numero di bollette annue da emettere ai sensi della regolazione vigente nell’anno di Y-2",null,"Punti di prelievo di clienti domestici in BT","Altri punti di prelievo in BT"]
[null,null,null,null,null," (anno di riferimento del dato: 2014)"]
[]
[]
[null,"Rev. 1"]

{"sheet":"3) Parametri","index":3,"n_rows":8,"n_cols":8,"rows_kept":8,"cut":false,"hidden":false,"merged":[[1,5,3,5],[1,6,1,7],[3,6,3,7],[1,1,1,2],[1,0,3,0]]}
[]
["Tabella 13 del TIV","Livelli  soglia  di  cui  al  comma  16quinquies.3  per  la  partecipazione  al meccanismo incentivante per una maggiore diffusione della bolletta elettronica.",null,null,null,"Tabella 14 del TIV","Ammontare di reintegrazione, per tipologia di cliente finale - meccanismo incentivante per una maggiore diffusione della bolletta elettronica."]
[null,"a","b",null,null,null,"Lettera  a)  Punti  di  prelievo  di clienti domestici in bassa tensione","Lettera    c) - Altri    punti    di prelievo in bassa tensione"]
[null,7.0000000000000007E-2,0.5,null,null,null,"euro/punto di prelievo"]
[null,null,null,null,null,"DiffSCc,Y>10",3.3,3.7]
[null,null,null,null,null,"DiffSCc,Y<10",2.1,2.2999999999999998]
[]
["Rev. 1"]

{"sheet":"4) Risultati di calcolo","index":4,"n_rows":50,"n_cols":7,"rows_kept":50,"cut":false,"hidden":false,"merged":[[47,5,47,6],[29,5,29,6],[30,5,30,6],[35,5,35,6],[41,5,41,6],[2,9,4,16],[32,8,32,11],[2,3,2,4],[2,5,2,6],[3,3,3,4],[3,5,3,6],[7,5,7,6],[13,5,13,6],[19,5,19,6],[23,5,23,6]]}
[]
[]
[null,null,null,"Ragione sociale esercente il servizio di Maggior Tutela",null,{"$f":"'1) Dati PDP dichiarati '!F3:G3","v":0}]
[null,null,null,"P.IVA",null,{"$f":"'1) Dati PDP dichiarati '!F4:G4","v":{"$error":"#N/A"}}]
[]
[]
[]
[null,null,null,null,null,"Calcolo valore di Xc"]
[null,null,null,null,null,"Punti di prelievo di clienti domestici in BT","Altri punti di prelievo in BT"]
[null,null,null,null,null,{"$f":"IFERROR('1) Dati PDP dichiarati '!F22/'1) Dati PDP dichiarati '!F26,0)","v":0},{"$f":"IFERROR('1) Dati PDP dichiarati '!G22/'1) Dati PDP dichiarati '!G26,0)","v":0}]
[]
[]
[]
[null,null,null,null,null,"Calcolo valore di PDPc,YSC"]
[null,null,null,null,null,"Punti di prelievo di clienti domestici in BT","Altri punti di prelievo in BT"]
[null,null,null,null,null,{"$f":"IFERROR('1) Dati PDP dichiarati '!F22*'2) Dati Bollette dichiarati'!F9/'2) Dati Bollette dichiarati'!F21,0)","v":0},{"$f":"IFERROR('1) Dati PDP dichiarati '!G22*'2) Dati Bollette dichiarati'!G9/'2) Dati Bollette dichiarati'!G21,)","v":0}]
[]
[]
[]
[null,null,null,null,null,"Calcolo valore di PDPc,anteYSC"]
[null,null,null,null,null,"Punti di prelievo di clienti domestici in BT","Altri punti di prelievo in BT"]
[null,null,null,null,null,{"$f":"IFERROR('1) Dati PDP dichiarati '!F30*'2) Dati Bollette dichiarati'!F13/'2) Dati Bollette dichiarati'!F25,0)","v":0},{"$f":"IFERROR('1) Dati PDP dichiarati '!G30*'2) Dati Bollette dichiarati'!G13/'2) Dati Bollette dichiarati'!G25,0)","v":0}]
[]
[null,null,null,null,null,"Calcolo valore di PDPc,Y-2FE"]
[null,null,null,null,null,"Punti di prelievo di clienti domestici in BT","Altri punti di prelievo in BT"]
[null,null,null,null,null,{"$f":"IFERROR('1) Dati PDP dichiarati '!F34*'2) Dati Bollette dichiarati'!F17/'2) Dati Bollette dichiarati'!F29,0)","v":0},{"$f":"IFERROR('1) Dati PDP dichiarati '!G34*'2) Dati Bollette dichiarati'!G17/'2) Dati Bollette dichiarati'!G29,0)","v":0}]
[]
[]
[]
[null,null,null,null,null,"Calcolo valore di REINT_SCc,Y"]
[null,null,null,null,null,"(per Y = 2016, 2017)"]
[null,null,null,null,null,"Punti di prelievo di clienti domestici in BT","Altri punti di prelievo in BT"]
[null,null,null,null,null,{"$f":"IF('1) Dati PDP dichiarati '!$F$17=\"NO\",'3) Parametri'!$G$6*($F$16+$F$22+$F$26),'3) Parametri'!$G$5*($F$16+$F$22+$F$26))","v":0},{"$f":"IF('1) Dati PDP dichiarati '!$F$17=\"NO\",'3) Parametri'!$H$6*($G$16+$G$22+$G$26),'3) Parametri'!$H$5*($G$16+$G$22+$G$26))","v":0}]
[]
[]
[null,null,null,null,null,"Calcolo valore di a"]
[null,null,null,null,null,"Punti di prelievo di clienti domestici in BT","Altri punti di prelievo in BT"]
[null,null,null,null,null,{"$f":"IF(F10<0.07,0,IF(AND(F10>0.07,F10<0.5),(F10-0.07)/(0.5-0.07),1))","v":0},{"$f":"IF(G10<0.07,0,IF(AND(G10>0.07,G10<0.5),(G10-0.07)/(0.5-0.07),1))","v":0}]
[]
[]
[]
[null,null,null,null,null,"Calcolo valore di ACSC"]
[null,null,null,null,null,"Punti di prelievo di clienti domestici in BT","Altri punti di prelievo in BT"]
[null,null,null,null,null,{"$f":"IF('1) Dati PDP dichiarati '!F9=\"NO\",0,F38*F33)","v":0},{"$f":"IF('1) Dati PDP dichiarati '!G9=\"NO\",0,G38*G33)","v":0}]
[]
[]
[]
[null,null,null,null,null,{"$f":"F44+G44","v":0}]
[]
[null,"Rev. 1"]

{"sheet":"Service","index":5,"n_rows":150,"n_cols":14,"rows_kept":150,"cut":false,"hidden":false,"merged":[[1,5,1,13]]}
[]
[null,null,"Menù a tendina scelta cella F8 in foglio 1) Dati PDP dichiarati",null,null,"Elenco esercenti EMT"]
[null,null,"SI",null,null,"Ragione Sociale","Codice Fiscale","Partita Iva","Indirizzo","Citta","CAP","Provincia","Regione","Tipologia"]
[null,null,"NO"]
[null,null,null,null,null,"A.E.C. Vipiteno","81005970215","00126510213","Via Dante, 5","VIPITENO","39049","BOLZANO","TRENTINO ALTO ADIGE","Distr + EMT"]
[null,null,null,null,null,"A.E.M. TIRANO SPA ","00864910146","00864910146","VIA S. AGOSTINO, 13","TIRANO","23037","SONDRIO","LOMBARDIA","Distr + EMT"]
[null,null,null,null,null,"A.S.SE.M. SPA","","01210650436","LOC. COLOTTO, 11","SAN SEVERINO MARCHE","62027","MACERATA","MARCHE","Distr + EMT"]
[null,null,null,null,null,"A2A ENERGIA S.P.A.","","12883420155","Corso di Porta Vittoria, 4","MILANO","20122","MILANO","LOMBARDIA","EMT puro"]
[null,null,null,null,null,"ACEA ENERGIA SPA","07305361003","07305361003","PIAZZALE OSTIENSE, 2","ROMA","00144","ROMA","LAZIO","EMT puro"]
[null,null,null,null,null,"ACSM Trading srl","01900420223","01900420223","Via guadagnini 31","FIERA DI PRIMIERO","38054","TRENTO","TRENTINO ALTO ADIGE","EMT puro"]
[null,null,null,null,null,"AEVV ENERGIE S.R.L.","00806850145","00806850145","VIA RAGAZZI DEL '99, 19","SONDRIO","23100","SONDRIO","LOMBARDIA","EMT puro"]
[null,null,null,null,null,"AGSM ENERGIA SPA","02968430237","02968430237","Via Lungadige Galtarossa, 8 8 - 37133 Verona (Verona)","VERONA","37121","VERONA","VENETO","EMT puro"]
[null,null,null,null,null,"AIM ENERGY SRL","","03013930247","Contrà Pedemuro San Biagio 72","VICENZA","36100","VICENZA","VENETO","EMT puro"]
[null,null,null,null,null,"ALPERIA ENERGY SRL","01745520211","01745520211","VIA DODICIVILLE 8","BOLZANO","39100","BOLZANO","TRENTINO ALTO ADIGE","EMT puro"]
[null,null,null,null,null,"Alperia Spa","","02858310218","via Dodiciville 8","BOLZANO","39100","BOLZANO","TRENTINO ALTO ADIGE","EMT puro"]
[null,null,null,null,null,"ALTO GARDA SERVIZI COMMERCIALE S.P.A.","01812900221","01812900221","VIA ARDARO, 27","RIVA DEL GARDA","38066","TRENTO","TRENTINO ALTO ADIGE","EMT puro"]
[null,null,null,null,null,"AMAIE SpA","00399050087","00399050087","Via Armea 96","SANREMO","18038","IMPERIA","LIGURIA","Distr + EMT"]
[null,null,null,null,null,"AMEA SPA","02066710605","02066710605","VIALE SAN FRANCESCO D'ASSISI 15/C","PALIANO","03018","FROSINONE","LAZIO","Distr + EMT"]
[null,null,null,null,null,"AMET Spa","","04938250729","Piazza Plebiscito, 20","TRANI","70059","BARI","PUGLIA","Distr + EMT"]
[null,null,null,null,null,"AMIAS SERVIZI SRL","02127560163","02127560163","CORSO MILANO19","SELVINO","24020","BERGAMO","LOMBARDIA","Distr + EMT"]
[null,null,null,null,null,"ASM - Azienda Servizi Municipalizzati Laces","00100580216","00100580216","Piazza Principale, 6","LACES","39021","BOLZANO","TRENTINO ALTO ADIGE","Distr + EMT"]
[null,null,null,null,null,"ASM Bressanone Spa","01717730210","01717730210","Via Alfred Ammon 24","BRESSANONE","39042","BOLZANO","TRENTINO ALTO ADIGE","Distr + EMT"]
[null,null,null,null,null,"ASM ENERGIA E AMBIENTE S.R.L.","03504970173","03504970173","VIA LAMARMORA, 230","BRESCIA","25124","BRESCIA","LOMBARDIA","EMT puro"]
[null,null,null,null,null,"ASM Silandro","82005970213","01095160212","Via Prinicipale 120","SILANDRO","39028","BOLZANO","TRENTINO ALTO ADIGE","Distr + EMT"]
[null,null,null,null,null,"ASM TIONE DI TRENTO","","01531350229","VIA STENICO 11","TIONE DI TRENTO","38079","TRENTO","TRENTINO ALTO ADIGE","Distr + EMT"]
[null,null,null,null,null,"ASM VENDITA E SERVIZI SRL ","","01991100189","VIA GASOMETRO 17","VOGHERA","27058","PAVIA","LOMBARDIA","EMT puro"]
[null,null,null,null,null,"ASM VOGHERA SPA","","01429910183","VIA POZZONI 2","VOGHERA","27058","PAVIA","LOMBARDIA","Distr + EMT"]
[null,null,null,null,null,"ASPM Soresina Servizi Srl","","01300290192","Via Cairoli, 17","SORESINA","26015","CREMONA","LOMBARDIA","Distr + EMT"]
[null,null,null,null,null,"ASTEA ENERGIA SPA","02078510423","02078510423","Via Guazzatore, 163","OSIMO","60027","ANCONA","MARCHE","EMT puro"]
[null,null,null,null,null,"ASTEA SPA","01501460438","01501460438","VIA L. GIGLI, 2","RECANATI","62019","MACERATA","MARCHE","Distr + EMT"]
[null,null,null,null,null,"Atena Trading srl","","02064090026","C.so Palestro n. 126","VERCELLI","13100","VERCELLI","PIEMONTE","EMT puro"]
[null,null,null,null,null,"AURINO - ENERGIA S.R.L.","00742610215","00742610215","FRAZ. CADIPIETRA, 109/B","VALLE AURINA","39030","BOLZANO","TRENTINO ALTO ADIGE","Distr + EMT"]
[null,null,null,null,null,"AZ. EL. HALLER SAS DI KRUSELBURGHER ANDREAS S.A.S.","01545520213","01545520213","Masseria 22","RACINES","39040","BOLZANO","TRENTINO ALTO ADIGE","Distr + EMT"]
[null,null,null,null,null,"AZ. EL. WEISSTEINER S.R.L. ","01508980214","01508980214","Via Kahler, 17","CHIENES","39030","BOLZANO","TRENTINO ALTO ADIGE","Distr + EMT"]
[null,null,null,null,null,"AZ. ELETTRICA EREDI DI BRUNNER JOSEF","01711310217","01711310217","MASSERIA, 1   LOC. RIDANNA","RACINES","39040","BOLZANO","TRENTINO ALTO ADIGE","Distr + EMT"]
[null,null,null,null,null,"AZIENDA CONSORZIALE SERVIZI MUNICIPALIZZATI S.p.A.","","00124190224","Via A. Guadagnini, 31","FIERA DI PRIMIERO","38054","TRENTO","TRENTINO ALTO ADIGE","Distr + EMT"]
[null,null,null,null,null,"Azienda Elettrica Anterselva S.r.l.","00100010214","00100010214","Fraz. Anterselva di Mezzo, 152","RASUN ANTERSELVA","39030","BOLZANO","TRENTINO ALTO ADIGE","Distr + EMT"]
[null,null,null,null,null,"Azienda Elettrica Chienes S.R.L.","00159160217","00159160217","Via Gruenbach 28","CHIENES","39030","BOLZANO","TRENTINO ALTO ADIGE","Distr + EMT"]
[null,null,null,null,null,"AZIENDA ELETTRICA COMUNALE - TUENNO","00256610221",null,"PIAZZA DELLA LIBERAZIONE, 34","TUENNO","38019","TRENTO","TRENTINO ALTO ADIGE","Distr + EMT"]
[null,null,null,null,null,"Azienda Elettrica Dobbiaco S.P.A.","00099970212","00099970212","Piazza Municipio","DOBBIACO","39034","BOLZANO","TRENTINO ALTO ADIGE","Distr + EMT"]
[null,null,null,null,null,"Azienda Elettrica Groebner Pilling Helga CO S.A.S.","01190060218","01190060218","Via Mulino 3","BRENNERO","39041","BOLZANO","TRENTINO ALTO ADIGE","Distr + EMT"]
[null,null,null,null,null,"Azienda Elettrica Preims SRL","02591000217","02591000217","Anello Nord 25","BRUNICO","39031","BOLZANO","TRENTINO ALTO ADIGE","Distr + EMT"]
[null,null,null,null,null,"Azienda Elettrica S. Martino S.R.L.","01035730215","01035730215","Paese 46","SAN MARTINO IN PASSIRIA","39010","BOLZANO","TRENTINO ALTO ADIGE","Distr + EMT"]
[null,null,null,null,null,"Azienda Elettrica Stein S.N.C.","01569400219","01569400219","Sasso, 92","VAL DI VIZZE","39049","BOLZANO","TRENTINO ALTO ADIGE","Distr + EMT"]
[null,null,null,null,null,"AZIENDA ENERGETICA VALTELLINA VALCHIAVENNA S.P.A.","00743600140","00743600140","VIA SANT'AGOSTINO, 13","TIRANO","23037","SONDRIO","LOMBARDIA","Distr + EMT"]
[null,null,null,null,null,"Azienda Pubbliservizi Brunico","","00734480213","Via Anello Nord, 19","BRUNICO","39031","BOLZANO","TRENTINO ALTO ADIGE","Distr + EMT"]
[null,null,null,null,null,"Azienda Servizi Polverigi S.r.l.","","02062980426","Via Marconi, 51","POLVERIGI","60020","ANCONA","MARCHE","Distr + EMT"]
[null,null,null,null,null,"AZIENDA SONDRIESE MULTISERVIZI S.P.A.","00686710146","00686710146","VIA RAGAZZI DEL '99, 19","SONDRIO","23100","SONDRIO","LOMBARDIA","Distr + EMT"]
[null,null,null,null,null,"AZIENDA SPECIALIZZATA SETTORE MULTISERVIZI SPA","","01210690432","corso Garibaldi 78","TOLENTINO","62029","MACERATA","MARCHE","Distr + EMT"]
[null,null,null,null,null,"C.V.A. TRADING S.r.l. a s.u.","01032450072","01032450072","Via Stazione, 31","CHATILLON","11024","AOSTA","VALLE D'AOSTA","EMT puro"]
[null,null,null,null,null,"Camuna Energia S.r.l.","","02144820988","Piazza Roma, 1","CEDEGOLO","25051","BRESCIA","LOMBARDIA","Distr + EMT"]
[null,null,null,null,null,"CASA DI RECLUSIONE GORGONA ISOLA",null,null,"TORRE NUOVA, 1","GORGONA ISOLA","57030","LIVORNO","TOSCANA","Distr + EMT"]
[null,null,null,null,null,"Centrale Elettrica S.N.C. Colz Spessa","01456270212","01456270212","Spessa 224","LA VALLE","39030","BOLZANO","TRENTINO ALTO ADIGE","Distr + EMT"]
[null,null,null,null,null,"CHRISTIAN LEIMEGGER - A.E. COSTA DI ONIES","LMGCRS67M18B220Y","01654980216","VIA ALTHING, 50","BRUNICO","39031","BOLZANO","TRENTINO ALTO ADIGE","Distr + EMT"]
[null,null,null,null,null,"COMUNE ANVERSA DEGLI ABRUZZI","00161690664","00161690664","via GIAMBATTISTA MANSO, 5, ","ANVERSA DEGLI ABRUZZI","67030","L'AQUILA","ABRUZZO","Distr + EMT"]
[null,null,null,null,null,"COMUNE CASTEL DEL MONTE","80002030668","00114540669","VIA DEL MUNICIPIO N. 1","CASTEL DEL MONTE","67023","L'AQUILA","ABRUZZO","Distr + EMT"]
[null,null,null,null,null,"COMUNE CASTELLO MOLINA DI FIEMME","00128850229","00128850229","VIA ROMA,38","CASTELLO-MOLINA DI FIEMME","38030","TRENTO","TRENTINO ALTO ADIGE","Distr + EMT"]
[null,null,null,null,null,"COMUNE DI ANDALO","00319630224","00319630224","PIAZZA CENTRALE NR. 1","ANDALO","38010","TRENTO","TRENTINO ALTO ADIGE","Distr + EMT"]
[null,null,null,null,null,"COMUNE DI AVIO","00110390226","00110390226","PIAZZA VITTORIO EMANUELE III°, 1","AVIO","38063","TRENTO","TRENTINO ALTO ADIGE","Distr + EMT"]
[null,null,null,null,null,"COMUNE DI AVIO","00110390226","00110390226","PIAZZA VITTORIO EMANUELE III°, 1","AVIO","38063","TRENTO","TRENTINO ALTO ADIGE","EMT puro"]
{"$rows_left_out":90}